[Upstream] Update to version 3.0.11.1

2 jobs for master in 5 minutes and 18 seconds (queued for 2 seconds)
Status Name Job ID Coverage
  Build
failed build #2363
archlinux

00:05:18

failed build #2360
archlinux

00:03:50

 
Name Stage Failure
failed
build Build
make[2]: *** [Makefile:12606: all] Error 2
make[2]: Leaving directory '/builds/booloki/aur-vlc-nox/src/vlc-3.0.11.1/modules'
make[1]: *** [Makefile:1565: all-recursive] Error 1
make[1]: Leaving directory '/builds/booloki/aur-vlc-nox/src/vlc-3.0.11.1'
make: *** [Makefile:1450: all] Error 2
==> ERROR: A failure occurred in build().
Aborting...
Cleaning up file based variables
ERROR: Job failed: exit code 1