Fix artifacts move

1 job for master in 5 minutes and 25 seconds (queued for 3 seconds)
Status Name Job ID Coverage
  Build
failed build #295
archlinux

00:05:25

 
Name Stage Failure
failed
build Build
make[3]: Leaving directory '/builds/booloki/aur-vlc-nox/src/vlc-3.0.6/modules'
make[2]: *** [Makefile:12537: all] Error 2
make[2]: Leaving directory '/builds/booloki/aur-vlc-nox/src/vlc-3.0.6/modules'
make[1]: *** [Makefile:1539: all-recursive] Error 1
make[1]: Leaving directory '/builds/booloki/aur-vlc-nox/src/vlc-3.0.6'
make: *** [Makefile:1424: all] Error 2
==> ERROR: A failure occurred in build().
Aborting...
ERROR: Job failed: exit code 1