Update to version 3.0.8

1 job for master in 4 minutes and 48 seconds (queued for 1 second)
Status Name Job ID Coverage
  Build
failed build #1471
archlinux

00:04:48

 
Name Stage Failure
failed
build Build
make[3]: Leaving directory '/builds/booloki/aur-vlc-nox/src/vlc-3.0.8/modules'
make[2]: *** [Makefile:12539: all] Error 2
make[2]: Leaving directory '/builds/booloki/aur-vlc-nox/src/vlc-3.0.8/modules'
make[1]: *** [Makefile:1553: all-recursive] Error 1
make[1]: Leaving directory '/builds/booloki/aur-vlc-nox/src/vlc-3.0.8'
make: *** [Makefile:1438: all] Error 2
==> ERROR: A failure occurred in build().
Aborting...
ERROR: Job failed: exit code 1